Target
5-hydroxytryptamine receptor 2C
Ligand
BDBM50199460
Substrate
Meas. Tech.
ChEMBL_1621579 (CHEMBL3863862)
Ki
298±n/a nM
Citation
 Tosh, DKCiancetta, AWarnick, ECrane, SGao, ZGJacobson, KA Structure-Based Scaffold Repurposing for G Protein-Coupled Receptors: Transformation of Adenosine Derivatives into 5HT J Med Chem 59:11006-11026 (2016)  
Target
Name:
5-hydroxytryptamine receptor 2C
Synonyms:
5-HT-2C 5-HT2C-INI 5-HTR2C 5-hydroxytryptamine receptor 2C (5-HT-2C) 5HT-1C HTR1C Serotonin (5-HT3) receptor Serotonin Receptor 2C
Type:
G Protein-Coupled Receptor (GPCR)
Mol. Mass.:
51836.79
Organism:
Homo sapiens (Human)
Description:
P28335
Residue:
458
  
Inhibitor
Name:
BDBM50199460
Synonyms:
CHEMBL3914843
Type:
Small organic molecule
Emp. Form.:
C20H26ClN5O3
Mol. Mass.:
419.905
SMILES:
[H][C@]12C[C@@]1(CO)[C@@H](O)[C@@H](O)[C@@H]2n1cnc2c(N[C@@H](C3CC3)C3CCC3)nc(Cl)nc12
: