Target
D(3) dopamine receptor
Ligand
BDBM50007518
Substrate
Meas. Tech.
ChEMBL_1621708 (CHEMBL3863991)
Ki
0.110000±n/a nM
Citation
 Cao, JSlack, RDBakare, OMBurzynski, CRais, RSlusher, BSKopajtic, TBonifazi, AEllenberger, MPYano, HHe, YBi, GHXi, ZXLoland, CJNewman, AH Novel and High Affinity 2-[(Diphenylmethyl)sulfinyl]acetamide (Modafinil) Analogues as Atypical Dopamine Transporter Inhibitors. J Med Chem 59:10676-10691 (2016)  
Target
Name:
D(3) dopamine receptor
Synonyms:
DOPAMINE D3 DRD3_HUMAN Dopamine D3 receptor (D3) Dopamine receptor Dopamine receptor D3
Type:
Mol. Mass.:
44243.43
Organism:
Homo sapiens (Human)
Description:
Residue:
400
  
Inhibitor
Name:
BDBM50007518
Synonyms:
(S)-3-chloro-5-ethyl-N-((1-ethylpyrrolidin-2-yl)methyl)-6-hydroxy-2-methoxybenzamide 3-Chloro-5-ethyl-N-((S)-1-ethyl-pyrrolidin-2-ylmethyl)-6-hydroxy-2-methoxy-benzamide 3-Chloro-5-ethyl-N-(1-ethyl-pyrrolidin-2-ylmethyl)-6-hydroxy-2-methoxy-benzamide (etichlopride) 3-chloro-5-ethyl-N-{[(2S)-1-ethylpyrrolidin-2-yl]methyl}-6-hydroxy-2-methoxybenzamide ETICLOPRIDE Eticlopride;3-Chloro-5-ethyl-N-(1-ethyl-pyrrolidin-2-ylmethyl)-6-hydroxy-2-methoxy-benzamide
Type:
Small organic molecule
Emp. Form.:
C17H25ClN2O3
Mol. Mass.:
340.845
SMILES:
CCN1CCC[C@H]1CNC(=O)c1c(O)c(CC)cc(Cl)c1OC
: