Target
CREB-binding protein/Histone acetyltransferase p300
Ligand
BDBM50200388
Substrate
Meas. Tech.
ChEMBL_1622037 (CHEMBL3864389)
IC50
430±n/a nM
Citation
 Crawford, TDRomero, FALai, KWTsui, VTaylor, AMde Leon Boenig, GNoland, CLMurray, JLy, JChoo, EFHunsaker, TLChan, EWMerchant, MKharbanda, SGascoigne, KEKaufman, SBeresini, MHLiao, JLiu, WChen, KXChen, ZConery, ARCôté, AJayaram, HJiang, YKiefer, JRKleinheinz, TLi, YMaher, JPardo, EPoy, FSpillane, KLWang, FWang, JWei, XXu, ZXu, ZYen, IZawadzke, LZhu, XBellon, SCummings, RCochran, AGAlbrecht, BKMagnuson, S Discovery of a Potent and Selective in Vivo Probe (GNE-272) for the Bromodomains of CBP/EP300. J Med Chem 59:10549-10563 (2016)  
Target
Name:
CREB-binding protein/Histone acetyltransferase p300
Synonyms:
Type:
Mol. Mass.:
Description:
ASSAY_ID of ChEMBL is 2168996
Components:
This complex has 2 components.
Component 1
Name:
Histone acetyltransferase p300
Synonyms:
EP300 HIF1A/p300/CREB-binding protein P300
Type:
Protein
Mol. Mass.:
264223.04
Organism:
Homo sapiens (Human)
Description:
Q09472
Residue:
2414
  
Component 2
Name:
CREB-binding protein
Synonyms:
CBP CREB-binding protein (CBP) CREBBP
Type:
Transcription Coactivator
Mol. Mass.:
265411.66
Organism:
Homo sapiens (Human)
Description:
Q92793
Residue:
2442
  
Inhibitor
Name:
BDBM50200388
Synonyms:
CHEMBL3908519
Type:
Small organic molecule
Emp. Form.:
C14H15FN4O
Mol. Mass.:
274.2935
SMILES:
CC(=O)N1CCc2[nH]nc(Nc3cccc(F)c3)c2C1
: