Target
Nuclear factor erythroid 2-related factor 2
Ligand
BDBM50205336
Substrate
Meas. Tech.
ChEMBL_1628344 (CHEMBL3870929)
IC50
200±n/a nM
Citation
 Yasuda, DNakajima, MYuasa, AObata, RTakahashi, KOhe, TIchimura, YKomatsu, MYamamoto, MImamura, RKojima, HOkabe, TNagano, TMashino, T Synthesis of Keap1-phosphorylated p62 and Keap1-Nrf2 protein-protein interaction inhibitors and their inhibitory activity. Bioorg Med Chem Lett 26:5956-5959 (2016)  
Target
Name:
Nuclear factor erythroid 2-related factor 2
Synonyms:
HEBP1 NF-E2-related factor 2 NFE2-related factor 2 NRF2 Nuclear factor, erythroid derived 2, like 2
Type:
PROTEIN
Mol. Mass.:
67786.89
Organism:
Homo sapiens (Human)
Description:
ChEMBL_107924
Residue:
605
  
Inhibitor
Name:
BDBM50205336
Synonyms:
CHEMBL3925906
Type:
Small organic molecule
Emp. Form.:
C28H28N2O8S3
Mol. Mass.:
616.726
SMILES:
CCOc1ccc(cc1)S(=O)(=O)Nc1cc(SCC(O)=O)c(NS(=O)(=O)c2ccc(OCC)cc2)c2ccccc12
: