Target
Aurora kinase A
Ligand
BDBM50206391
Substrate
Meas. Tech.
ChEMBL_1628978 (CHEMBL3871604)
IC50
480±n/a nM
Citation
 Chang, CFLin, WHKe, YYLin, YSWang, WCChen, CHKuo, PCHsu, JTAUang, BJHsieh, HP Discovery of novel inhibitors of Aurora kinases with indazole scaffold: In silico fragment-based and knowledge-based drug design. Eur J Med Chem 124:186-199 (2016)  
Target
Name:
Aurora kinase A
Synonyms:
AIK ARK-1 AURA AURKA_HUMAN Aurora 2 Aurora kinase A (AURKA) Aurora kinase A (Aurora-2) Aurora/IPL1-related kinase 1 Breast tumor-amplified kinase IAK1 STK15 GN Serine/threonine kinase 15 Serine/threonine-protein kinase 6 Serine/threonine-protein kinase aurora-A aurora-2 | hARK1
Type:
Serine/threonine-protein kinase
Mol. Mass.:
45830.98
Organism:
Homo sapiens (Human)
Description:
O14965
Residue:
403
  
Inhibitor
Name:
BDBM50206391
Synonyms:
CHEMBL3894492
Type:
Small organic molecule
Emp. Form.:
C24H20N4O6S
Mol. Mass.:
492.504
SMILES:
COc1ccc(cc1)S(=O)(=O)Nc1ccc2[nH]nc(-c3cccc(NC(=O)\C=C/C(O)=O)c3)c2c1
: