Target
Aurora kinase A
Ligand
BDBM50206858
Substrate
Meas. Tech.
ChEBML_1629279
Ki
29±n/a nM
Citation
 Morioka, M 3-Cyano-6-(5-methyl-3-pyrazoloamino) pyridines (Part 2): A dual inhibitor of Aurora kinase and tubulin polymerization. Bioorg Med Chem Lett 26:5860-5862 (2016)  
Target
Name:
Aurora kinase A
Synonyms:
AIK ARK-1 AURA AURKA_HUMAN Aurora 2 Aurora kinase A (AURKA) Aurora kinase A (Aurora-2) Aurora/IPL1-related kinase 1 Breast tumor-amplified kinase IAK1 STK15 GN Serine/threonine kinase 15 Serine/threonine-protein kinase 6 Serine/threonine-protein kinase aurora-A aurora-2 | hARK1
Type:
Serine/threonine-protein kinase
Mol. Mass.:
45830.98
Organism:
Homo sapiens (Human)
Description:
O14965
Residue:
403
  
Inhibitor
Name:
BDBM50206858
Synonyms:
CHEMBL3921905
Type:
Small organic molecule
Emp. Form.:
C18H19N7O
Mol. Mass.:
349.3898
SMILES:
Cc1cc(Nc2cc(C)c(C#N)c(NCCOc3ccncc3)n2)n[nH]1
: