Target
Cytochrome P450 1A2
Ligand
BDBM50206857
Substrate
Meas. Tech.
ChEBML_1629314
IC50
<400±n/a nM
Citation
 Morioka, M 3-Cyano-6-(5-methyl-3-pyrazoloamino) pyridines (Part 2): A dual inhibitor of Aurora kinase and tubulin polymerization. Bioorg Med Chem Lett 26:5860-5862 (2016)  
Target
Name:
Cytochrome P450 1A2
Synonyms:
CP1A2_HUMAN CYPIA2 Cytochrome P(3)450 Cytochrome P450 1A2 (CYP1A2) Cytochrome P450-P3
Type:
Enzyme
Mol. Mass.:
58423.38
Organism:
Homo sapiens (Human)
Description:
P05177
Residue:
516
  
Inhibitor
Name:
BDBM50206857
Synonyms:
CHEMBL3922893
Type:
Small organic molecule
Emp. Form.:
C18H19N7O
Mol. Mass.:
349.3898
SMILES:
Cc1cc(Nc2cc(C)c(C#N)c(NCCOc3ccccn3)n2)n[nH]1
: