Target
Cytochrome P450 1A2
Ligand
BDBM50206861
Substrate
Meas. Tech.
ChEMBL_1629314 (CHEMBL3871940)
IC50
1400±n/a nM
Citation
 Morioka, M 3-Cyano-6-(5-methyl-3-pyrazoloamino) pyridines (Part 2): A dual inhibitor of Aurora kinase and tubulin polymerization. Bioorg Med Chem Lett 26:5860-5862 (2016)  
Target
Name:
Cytochrome P450 1A2
Synonyms:
CP1A2_HUMAN CYPIA2 Cytochrome P(3)450 Cytochrome P450 1A2 (CYP1A2) Cytochrome P450-P3
Type:
Enzyme
Mol. Mass.:
58423.38
Organism:
Homo sapiens (Human)
Description:
P05177
Residue:
516
  
Inhibitor
Name:
BDBM50206861
Synonyms:
CHEMBL3928420
Type:
Small organic molecule
Emp. Form.:
C20H23N7O
Mol. Mass.:
377.4429
SMILES:
CCc1ccc(OCCNc2nc(Nc3cc(C)[nH]n3)cc(C)c2C#N)cn1
: