Target
Cytochrome P450 11B2, mitochondrial
Ligand
BDBM50206963
Substrate
Meas. Tech.
ChEMBL_1629493 (CHEMBL3872119)
IC50
0.600000±n/a nM
Citation
 Whitehead, BRLo, MMAli, APark, MKHoyt, SBXiong, YCai, JCarswell, ECooke, AMacLean, JRatcliffe, PRobinson, JBennett, DJClemas, JAWisniewski, TStruthers, MCully, DMacNeil, DJ Imidazopyridyl compounds as aldosterone synthase inhibitors. Bioorg Med Chem Lett 27:143-146 (2017)  
Target
Name:
Cytochrome P450 11B2, mitochondrial
Synonyms:
Aldosterone Synthase (CYP11B2) Aldosterone-synthesizing enzyme CYP11B2 Cytochrome P450 11B2 Cytochrome P450 11B2, mitochondrial P-450C18 | Steroid 18-hydroxylase
Type:
Protein
Mol. Mass.:
57582.15
Organism:
Homo sapiens (Human)
Description:
P19099
Residue:
503
  
Inhibitor
Name:
BDBM50206963
Synonyms:
CHEMBL3948337 | US9518055, Example 41
Type:
Small organic molecule
Emp. Form.:
C19H14FN3
Mol. Mass.:
303.333
SMILES:
Fc1ccc2nc(c(C3CC3)n2c1)-c1cncc2ccccc12
: