Target
D(3) dopamine receptor
Ligand
BDBM50207119
Substrate
Meas. Tech.
ChEMBL_1630050 (CHEMBL3872756)
Ki
1.1±n/a nM
Citation
 Chen, XWSun, YYFu, LLi, JQ Synthesis and pharmacological characterization of novel N-(trans-4-(2-(4-(benzo[d]isothiazol-3-yl)piperazin-1-yl)ethyl)cyclohexyl)amides as potential multireceptor atypical antipsychotics. Eur J Med Chem 123:332-353 (2016)  
Target
Name:
D(3) dopamine receptor
Synonyms:
DOPAMINE D3 DRD3_HUMAN Dopamine D3 receptor (D3) Dopamine receptor Dopamine receptor D3
Type:
Mol. Mass.:
44243.43
Organism:
Homo sapiens (Human)
Description:
Residue:
400
  
Inhibitor
Name:
BDBM50207119
Synonyms:
CHEMBL3941190
Type:
Small organic molecule
Emp. Form.:
C24H31N5O2S
Mol. Mass.:
453.6
SMILES:
Nc1ccc2c(nsc2c1)N1CCN(CC[C@H]2CC[C@@H](CC2)NC(=O)c2ccco2)CC1
: