Target
5-hydroxytryptamine receptor 1A
Ligand
BDBM50207117
Substrate
Meas. Tech.
ChEMBL_1630051 (CHEMBL3872757)
Ki
39±n/a nM
Citation
 Chen, XWSun, YYFu, LLi, JQ Synthesis and pharmacological characterization of novel N-(trans-4-(2-(4-(benzo[d]isothiazol-3-yl)piperazin-1-yl)ethyl)cyclohexyl)amides as potential multireceptor atypical antipsychotics. Eur J Med Chem 123:332-353 (2016)  
Target
Name:
5-hydroxytryptamine receptor 1A
Synonyms:
5-HT-1A 5-hydroxytryptamine receptor 1A (5-HT-1A) ADRB2RL1 Dopamine D2 receptor and serotonin 1a receptor HTR1A | Serotonin receptor 1A
Type:
Mol. Mass.:
46122.49
Organism:
Homo sapiens (Human)
Description:
Residue:
422
  
Inhibitor
Name:
BDBM50207117
Synonyms:
CHEMBL3970746
Type:
Small organic molecule
Emp. Form.:
C24H29N5O4S
Mol. Mass.:
483.583
SMILES:
[O-][N+](=O)c1ccc2c(nsc2c1)N1CCN(CC[C@H]2CC[C@@H](CC2)NC(=O)c2ccco2)CC1
: