Target
High affinity cAMP-specific 3',5'-cyclic phosphodiesterase 7A
Ligand
BDBM50208314
Substrate
Meas. Tech.
ChEMBL_1632650 (CHEMBL3875442)
IC50
>100000±n/a nM
Citation
 Zhou, ZZGe, BCZhong, QPHuang, CCheng, YFYang, XMWang, HTXu, JP Development of highly potent phosphodiesterase 4 inhibitors with anti-neuroinflammation potential: Design, synthesis, and structure-activity relationship study of catecholamides bearing aromatic rings. Eur J Med Chem 124:372-379 (2016)  
Target
Name:
High affinity cAMP-specific 3',5'-cyclic phosphodiesterase 7A
Synonyms:
3',5'-cyclic phosphodiesterase PDE7A_HUMAN Phosphodiesterase 7 (PDE7) Phosphodiesterase 7A (PDE7A1)
Type:
Enzyme
Mol. Mass.:
55514.96
Organism:
Homo sapiens (Human)
Description:
Q13946
Residue:
482
  
Inhibitor
Name:
BDBM50208314
Synonyms:
CHEMBL3884788
Type:
Small organic molecule
Emp. Form.:
C18H16ClF2NO3
Mol. Mass.:
367.774
SMILES:
FC(F)Oc1ccc(cc1OCC1CC1)C(=O)Nc1ccccc1Cl
: