Target
Voltage-dependent L-type calcium channel subunit alpha-1S
Ligand
BDBM50280077
Substrate
Meas. Tech.
ChEMBL_42938 (CHEMBL654580)
Ki
5.6±n/a nM
Citation
  TBA Bioorg Med Chem Lett 2:1193-1198 (1992)   
Target
Name:
Voltage-dependent L-type calcium channel subunit alpha-1S
Synonyms:
CAC1S_RAT Cacn1 Cacnl1a3 Cchl1a3 Voltage-gated L-type calcium channel Voltage-gated calcium channel subunit alpha Cav1.1
Type:
PROTEIN
Mol. Mass.:
210392.58
Organism:
Rattus norvegicus
Description:
ChEMBL_92777
Residue:
1850
  
Inhibitor
Name:
BDBM50280077
Synonyms:
CHEMBL18988 | sec-Butyl-[4-(2,4-dimethoxy-phenyl)-4H-benzo[b]pyrrolo[1,2-d][1,4]thiazin-1-ylmethyl]-amine
Type:
Small organic molecule
Emp. Form.:
C24H28N2O2S
Mol. Mass.:
408.556
SMILES:
CCC(C)NCc1ccc2C(Sc3ccccc3-n12)c1ccc(OC)cc1OC
: