Target
Type-1/Type-2 angiotensin II receptor
Ligand
BDBM50009718
Substrate
Meas. Tech.
ChEMBL_36176 (CHEMBL876744)
IC50
6.0±n/a nM
Citation
  TBA Bioorg Med Chem Lett 3:1019-1024 (1993)   
Target
Name:
Type-1/Type-2 angiotensin II receptor
Synonyms:
Angiotensin II receptor
Type:
Mol. Mass.:
Description:
ASSAY_ID of ChEMBL is 357784
Components:
This complex has 2 components.
Component 1
Name:
Type-1 angiotensin II receptor
Synonyms:
AGTR1 AGTR1B AT1 AT1BR AT2R1B Angiotensin II receptor Type-1 angiotensin II receptor (AT1)
Type:
Protein
Mol. Mass.:
41080.75
Organism:
Homo sapiens (Human)
Description:
P30556
Residue:
359
  
Component 2
Name:
Type-2 angiotensin II receptor
Synonyms:
AGTR2 AT2 Angiotensin II type 2 (AT-2) receptor Type-2 angiotensin II receptor
Type:
Enzyme Catalytic Domain
Mol. Mass.:
41201.61
Organism:
Homo sapiens (Human)
Description:
Angiotensin II, central 0 0::P50052
Residue:
363
  
Inhibitor
Name:
BDBM50009718
Synonyms:
2-Ethyl-5,7-dimethyl-3-[2'-(1H-tetrazol-5-yl)-biphenyl-4-ylmethyl]-3H-imidazo[4,5-b]pyridine 2-Ethyl-5,7-dimethyl-3-[2'-(1H-tetrazol-5-yl)-biphenyl-4-ylmethyl]-3H-imidazo[4,5-b]pyridine (L158809) 2-Ethyl-5,7-dimethyl-3-[2'-(2H-tetrazol-5-yl)-biphenyl-4-ylmethyl]-3H-imidazo[4,5-b]pyridine(L-158809) CHEMBL7550 | L-158809
Type:
Small organic molecule
Emp. Form.:
C24H23N7
Mol. Mass.:
409.4863
SMILES:
CCc1nc2c(C)cc(C)nc2n1Cc1ccc(cc1)-c1ccccc1-c1nnn[nH]1
: