Target
D(4) dopamine receptor
Ligand
BDBM50007185
Substrate
Meas. Tech.
ChEBML_61327
Ki
13±n/a nM
Citation
  TBA Bioorg Med Chem Lett 6:1227-1232 (1996)   
Target
Name:
D(4) dopamine receptor
Synonyms:
D(2C) dopamine receptor DOPAMINE D4.2 DRD4 Dopamine D4 receptor
Type:
Enzyme
Mol. Mass.:
48373.19
Organism:
Homo sapiens (Human)
Description:
P21917
Residue:
419
  
Inhibitor
Name:
BDBM50007185
Synonyms:
CHEMBL21008 | N-{4-[4-(2-Methoxy-phenyl)-piperazin-1-yl]-butyl}-2,2-dimethyl-propionamide
Type:
Small organic molecule
Emp. Form.:
C20H33N3O2
Mol. Mass.:
347.4949
SMILES:
COc1ccccc1N1CCN(CCCCNC(=O)C(C)(C)C)CC1
: