Target
D(4) dopamine receptor
Ligand
BDBM50213861
Substrate
Meas. Tech.
ChEMBL_61327 (CHEMBL670102)
Ki
126±n/a nM
Citation
  TBA Bioorg Med Chem Lett 6:1227-1232 (1996)   
Target
Name:
D(4) dopamine receptor
Synonyms:
D(2C) dopamine receptor DOPAMINE D4.2 DRD4 Dopamine D4 receptor
Type:
Enzyme
Mol. Mass.:
48373.19
Organism:
Homo sapiens (Human)
Description:
P21917
Residue:
419
  
Inhibitor
Name:
BDBM50213861
Synonyms:
CHEMBL277937
Type:
Small organic molecule
Emp. Form.:
C19H30FN3O
Mol. Mass.:
335.4594
SMILES:
CC(C)(C)C(=O)NCCCCN1CCN(CC1)c1ccc(F)cc1
: