Target
D(4) dopamine receptor
Ligand
BDBM50213856
Substrate
Meas. Tech.
ChEMBL_61327 (CHEMBL670102)
Ki
16±n/a nM
Citation
  TBA Bioorg Med Chem Lett 6:1227-1232 (1996)   
Target
Name:
D(4) dopamine receptor
Synonyms:
D(2C) dopamine receptor DOPAMINE D4.2 DRD4 Dopamine D4 receptor
Type:
Enzyme
Mol. Mass.:
48373.19
Organism:
Homo sapiens (Human)
Description:
P21917
Residue:
419
  
Inhibitor
Name:
BDBM50213856
Synonyms:
CHEMBL21011
Type:
Small organic molecule
Emp. Form.:
C20H32ClN3O
Mol. Mass.:
365.941
SMILES:
CCC(C)(C)C(=O)NCCCCN1CCN(CC1)c1ccc(Cl)cc1
: