Target
Plasminogen
Ligand
BDBM50218582
Substrate
Meas. Tech.
ChEMBL_222782 (CHEMBL847111)
IC50
409±n/a nM
Citation
 Radau, GRauh, D Synthesis of a cyanopeptide-analogue with trypsin activating properties. Bioorg Med Chem Lett 10:779-81 (2000)  
Target
Name:
Plasminogen
Synonyms:
Activation peptide PLG Plasmin Plasmin heavy chain A, short form | Plasmin light chain B
Type:
Enzyme
Mol. Mass.:
90579.18
Organism:
Homo sapiens (Human)
Description:
Residue:
810
  
Inhibitor
Name:
BDBM50218582
Synonyms:
CHEMBL123993
Type:
Small organic molecule
Emp. Form.:
C33H44N6O11S
Mol. Mass.:
732.801
SMILES:
NC(=N)N1CCC[C@H](NC(=O)C2CC3CCC(O)CC3N2C(=O)[C@@H](Cc2ccc(O)cc2)NC(=O)[C@H](O)Cc2ccc(OS(O)(=O)=O)cc2)C1O
: