Target
cAMP-specific 3',5'-cyclic phosphodiesterase 4C
Ligand
BDBM14361
Substrate
Meas. Tech.
ChEMBL_157223 (CHEMBL769547)
IC50
1800±n/a nM
Citation
 Nam, GYoon, CMKim, ERhee, CKKim, JHShin, JHKim, SH Syntheses and evaluation of pyrido[2,3-dlpyrimidine-2,4-diones as PDE 4 inhibitors. Bioorg Med Chem Lett 11:611-4 (2001)  
Target
Name:
cAMP-specific 3',5'-cyclic phosphodiesterase 4C
Synonyms:
Dpde1 Pde4c
Type:
PROTEIN
Mol. Mass.:
60038.21
Organism:
Rattus norvegicus
Description:
ChEMBL_104732
Residue:
536
  
Inhibitor
Name:
BDBM14361
Synonyms:
(R,S)-Rolipram 4-[3-(cyclopentyloxy)-4-methoxyphenyl]pyrrolidin-2-one CHEMBL63 | Rolipram
Type:
Small organic molecule
Emp. Form.:
C16H21NO3
Mol. Mass.:
275.3428
SMILES:
COc1ccc(cc1OC1CCCC1)C1CNC(=O)C1
: