Target
Dihydrofolate reductase
Ligand
BDBM50026318
Substrate
Meas. Tech.
ChEMBL_54735 (CHEMBL667186)
Ki
0.050±n/a nM
Citation
 Doweyko, AM The hypothetical active site lattice. An approach to modelling active sites from data on inhibitor molecules. J Med Chem 31:1396-406 (1988)  
Target
Name:
Dihydrofolate reductase
Synonyms:
Dihydrofolate reductase (F31V) | dfrA17
Type:
Mol. Mass.:
17532.46
Organism:
Escherichia coli
Description:
Residue:
157
  
Inhibitor
Name:
BDBM50026318
Synonyms:
7-[5-(2,4-Diamino-pyrimidin-5-ylmethyl)-2,3-dimethoxy-phenoxy]-heptanoic acid TCMDC-137630
Type:
Small organic molecule
Emp. Form.:
C20H28N4O5
Mol. Mass.:
404.4601
SMILES:
COc1cc(Cc2cnc(N)nc2N)cc(OCCCCCCC(O)=O)c1OC
: