Target
Sterol O-acyltransferase 1
Ligand
BDBM50227908
Substrate
Meas. Tech.
ChEMBL_28500 (CHEMBL884116)
IC50
406±n/a nM
Citation
 DeVries, VGBloom, JDDutia, MDKatocs, ASLargis, EE Potential antiatherosclerotic agents. 6. Hypocholesterolemic trisubstituted urea analogues. J Med Chem 32:2318-25 (1989)  
Target
Name:
Sterol O-acyltransferase 1
Synonyms:
ACAT-1 Acat SOAT1_RAT Sterol O-acyltransferase, Soat
Type:
PROTEIN
Mol. Mass.:
64165.56
Organism:
Rattus norvegicus
Description:
ChEMBL_28796
Residue:
545
  
Inhibitor
Name:
BDBM50227908
Synonyms:
CHEMBL77988
Type:
Small organic molecule
Emp. Form.:
C19H23Cl3N2O2
Mol. Mass.:
417.757
SMILES:
CCCCCCCN(Cc1ccco1)C(=O)Nc1c(Cl)cc(Cl)cc1Cl
: