Target
Sterol O-acyltransferase 1
Ligand
BDBM50227916
Substrate
Meas. Tech.
ChEMBL_28021 (CHEMBL641220)
IC50
39900±n/a nM
Citation
 DeVries, VGBloom, JDDutia, MDKatocs, ASLargis, EE Potential antiatherosclerotic agents. 6. Hypocholesterolemic trisubstituted urea analogues. J Med Chem 32:2318-25 (1989)  
Target
Name:
Sterol O-acyltransferase 1
Synonyms:
ACACT ACAT Acetyl-CoA acetyltransferase, mitochondrial Acyl-CoA: cholesterol acyltransferase (ACAT) Cholesterol acyltransferase 1 SOAT1 STAT
Type:
Multi-pass membrane protein may form homo- or heterodimers.
Mol. Mass.:
64751.94
Organism:
Homo sapiens (Human)
Description:
P35610
Residue:
550
  
Inhibitor
Name:
BDBM50227916
Synonyms:
CHEMBL307666
Type:
Small organic molecule
Emp. Form.:
C21H19ClN2O
Mol. Mass.:
350.841
SMILES:
Clc1cccc(NC(=O)N(Cc2ccccc2)Cc2ccccc2)c1
: