Target
Phosphatidylinositol 4-kinase type 2-alpha
Ligand
BDBM50228351
Substrate
Meas. Tech.
ChEMBL_152907 (CHEMBL758630)
Ki
8400±n/a nM
Citation
 Young, RCJones, MMilliner, KJRana, KKWard, JG Purine derivatives as competitive inhibitors of human erythrocyte membrane phosphatidylinositol 4-kinase. J Med Chem 33:2073-80 (1990)  
Target
Name:
Phosphatidylinositol 4-kinase type 2-alpha
Synonyms:
P4K2A_HUMAN Phosphatidylinositol 4-kinase type 2-alpha | Phosphatidylinositol 4-kinase type II-alpha
Type:
PROTEIN
Mol. Mass.:
54030.26
Organism:
Homo sapiens (Human)
Description:
ChEMBL_104812
Residue:
479
  
Inhibitor
Name:
BDBM50228351
Synonyms:
CHEMBL1321883
Type:
Small organic molecule
Emp. Form.:
C13H17N5O4
Mol. Mass.:
307.3052
SMILES:
[H][C@]12OC(C)(C)O[C@@]1([H])[C@@H](O[C@@H]2CO)n1cnc2c(N)ncnc12
: