Target
Phosphatidylinositol 4-kinase type 2-alpha
Ligand
BDBM50228496
Substrate
Meas. Tech.
ChEMBL_152907 (CHEMBL758630)
Ki
54400±n/a nM
Citation
 Young, RCJones, MMilliner, KJRana, KKWard, JG Purine derivatives as competitive inhibitors of human erythrocyte membrane phosphatidylinositol 4-kinase. J Med Chem 33:2073-80 (1990)  
Target
Name:
Phosphatidylinositol 4-kinase type 2-alpha
Synonyms:
P4K2A_HUMAN Phosphatidylinositol 4-kinase type 2-alpha | Phosphatidylinositol 4-kinase type II-alpha
Type:
PROTEIN
Mol. Mass.:
54030.26
Organism:
Homo sapiens (Human)
Description:
ChEMBL_104812
Residue:
479
  
Inhibitor
Name:
BDBM50228496
Synonyms:
CHEMBL303563
Type:
Small organic molecule
Emp. Form.:
C15H11N5
Mol. Mass.:
261.2813
SMILES:
Nc1ncnc2n(cnc12)-c1cccc2ccccc12
: