Target
Phosphatidylinositol 4-kinase type 2-alpha
Ligand
BDBM50013706
Substrate
Meas. Tech.
ChEMBL_152907 (CHEMBL758630)
Ki
57900±n/a nM
Citation
 Young, RCJones, MMilliner, KJRana, KKWard, JG Purine derivatives as competitive inhibitors of human erythrocyte membrane phosphatidylinositol 4-kinase. J Med Chem 33:2073-80 (1990)  
Target
Name:
Phosphatidylinositol 4-kinase type 2-alpha
Synonyms:
P4K2A_HUMAN Phosphatidylinositol 4-kinase type 2-alpha | Phosphatidylinositol 4-kinase type II-alpha
Type:
PROTEIN
Mol. Mass.:
54030.26
Organism:
Homo sapiens (Human)
Description:
ChEMBL_104812
Residue:
479
  
Inhibitor
Name:
BDBM50013706
Synonyms:
9-Benzyl-9H-adenine 9-benzyl-9H-purin-6-amine | CHEMBL266094
Type:
Small organic molecule
Emp. Form.:
C12H11N5
Mol. Mass.:
225.2492
SMILES:
Nc1ncnc2n(Cc3ccccc3)cnc12
: