Target
Phosphatidylinositol 4-kinase type 2-alpha
Ligand
BDBM50228490
Substrate
Meas. Tech.
ChEMBL_152907 (CHEMBL758630)
Ki
22700±n/a nM
Citation
 Young, RCJones, MMilliner, KJRana, KKWard, JG Purine derivatives as competitive inhibitors of human erythrocyte membrane phosphatidylinositol 4-kinase. J Med Chem 33:2073-80 (1990)  
Target
Name:
Phosphatidylinositol 4-kinase type 2-alpha
Synonyms:
P4K2A_HUMAN Phosphatidylinositol 4-kinase type 2-alpha | Phosphatidylinositol 4-kinase type II-alpha
Type:
PROTEIN
Mol. Mass.:
54030.26
Organism:
Homo sapiens (Human)
Description:
ChEMBL_104812
Residue:
479
  
Inhibitor
Name:
BDBM50228490
Synonyms:
Benzo[G]Quinazolin-4-Ylamine | CHEMBL62648
Type:
Small organic molecule
Emp. Form.:
C12H9N3
Mol. Mass.:
195.22
SMILES:
Nc1ncnc2cc3ccccc3cc12
: