Target
Prostaglandin G/H synthase 1/2
Ligand
BDBM50228739
Substrate
Meas. Tech.
ChEMBL_157972 (CHEMBL858257)
IC50
9772372±n/a nM
Citation
 Moser, PSallmann, AWiesenberg, I Synthesis and quantitative structure-activity relationships of diclofenac analogues. J Med Chem 33:2358-68 (1990)  
Target
Name:
Prostaglandin G/H synthase 1/2
Synonyms:
Cyclooxygenase
Type:
Mol. Mass.:
Description:
ASSAY_ID of ChEMBL is 1570295
Components:
This complex has 2 components.
Component 1
Name:
Prostaglandin G/H synthase 2
Synonyms:
COX2 Cyclooxygenase-2 PGH2_BOVIN PHS II Prostaglandin H2 synthase 2 | Prostaglandin-endoperoxide synthase 2
Type:
PROTEIN
Mol. Mass.:
69173.20
Organism:
Bos taurus
Description:
ChEMBL_157990
Residue:
604
  
Component 2
Name:
Prostaglandin G/H synthase 1
Synonyms:
COX-1 Cyclooxygenase PGH1_BOVIN | PTGS1
Type:
PROTEIN
Mol. Mass.:
68814.10
Organism:
Bos taurus
Description:
ChEMBL_547440
Residue:
600
  
Inhibitor
Name:
BDBM50228739
Synonyms:
CHEMBL77245
Type:
Small organic molecule
Emp. Form.:
C14H10F2NNaO2
Mol. Mass.:
285.2213
SMILES:
[Na+].[O-]C(=O)Cc1ccccc1Nc1ccc(F)cc1F
: