Target
cAMP-specific 3',5'-cyclic phosphodiesterase 4C
Ligand
BDBM50228851
Substrate
Meas. Tech.
ChEMBL_42939 (CHEMBL654581)
IC50
4000±n/a nM
Citation
 Vinick, FJSaccomano, NAKoe, BKNielsen, JAWilliams, IHThadeio, PFJung, SMeltz, MJohnson, JLebel, LA Nicotinamide ethers: novel inhibitors of calcium-independent phosphodiesterase and [3H]rolipram binding. J Med Chem 34:86-9 (1991)  
Target
Name:
cAMP-specific 3',5'-cyclic phosphodiesterase 4C
Synonyms:
Dpde1 Pde4c
Type:
PROTEIN
Mol. Mass.:
60038.21
Organism:
Rattus norvegicus
Description:
ChEMBL_104732
Residue:
536
  
Inhibitor
Name:
BDBM50228851
Synonyms:
CHEMBL169911
Type:
Small organic molecule
Emp. Form.:
C19H14F2N2O2
Mol. Mass.:
340.3235
SMILES:
Fc1ccc(CNC(=O)c2cccnc2Oc2ccc(F)cc2)cc1
: