Target
cAMP-specific 3',5'-cyclic phosphodiesterase 4C
Ligand
BDBM50008705
Substrate
Meas. Tech.
ChEMBL_176821 (CHEMBL780514)
IC50
49000±n/a nM
Citation
 Vinick, FJSaccomano, NAKoe, BKNielsen, JAWilliams, IHThadeio, PFJung, SMeltz, MJohnson, JLebel, LA Nicotinamide ethers: novel inhibitors of calcium-independent phosphodiesterase and [3H]rolipram binding. J Med Chem 34:86-9 (1991)  
Target
Name:
cAMP-specific 3',5'-cyclic phosphodiesterase 4C
Synonyms:
Dpde1 Pde4c
Type:
PROTEIN
Mol. Mass.:
60038.21
Organism:
Rattus norvegicus
Description:
ChEMBL_104732
Residue:
536
  
Inhibitor
Name:
BDBM50008705
Synonyms:
CHEMBL168418 | N-Benzyl-2-phenoxy-nicotinamide
Type:
Small organic molecule
Emp. Form.:
C19H16N2O2
Mol. Mass.:
304.3425
SMILES:
O=C(NCc1ccccc1)c1cccnc1Oc1ccccc1
: