Target
Similar to alpha-tubulin isoform 1
Ligand
BDBM50229495
Substrate
Meas. Tech.
ChEMBL_39798 (CHEMBL876771)
IC50
29000±n/a nM
Citation
 Cushman, MNagarathnam, DGopal, DChakraborti, AKLin, CMHamel, E Synthesis and evaluation of stilbene and dihydrostilbene derivatives as potential anticancer agents that inhibit tubulin polymerization. J Med Chem 34:2579-88 (1991)  
Target
Name:
Similar to alpha-tubulin isoform 1
Synonyms:
Similar to alpha-tubulin isoform 1
Type:
PROTEIN
Mol. Mass.:
10383.05
Organism:
Bos taurus
Description:
ChEMBL_104716
Residue:
99
  
Inhibitor
Name:
BDBM50229495
Synonyms:
CHEMBL314500
Type:
Small organic molecule
Emp. Form.:
C19H25NO3
Mol. Mass.:
315.4067
SMILES:
COc1cc(CCc2ccc(cc2)N(C)C)cc(OC)c1OC
: