Target
Similar to alpha-tubulin isoform 1
Ligand
BDBM50009562
Substrate
Meas. Tech.
ChEMBL_39798 (CHEMBL876771)
IC50
23000±n/a nM
Citation
 Cushman, MNagarathnam, DGopal, DChakraborti, AKLin, CMHamel, E Synthesis and evaluation of stilbene and dihydrostilbene derivatives as potential anticancer agents that inhibit tubulin polymerization. J Med Chem 34:2579-88 (1991)  
Target
Name:
Similar to alpha-tubulin isoform 1
Synonyms:
Similar to alpha-tubulin isoform 1
Type:
PROTEIN
Mol. Mass.:
10383.05
Organism:
Bos taurus
Description:
ChEMBL_104716
Residue:
99
  
Inhibitor
Name:
BDBM50009562
Synonyms:
(4-Methoxy-phenyl)-(3,4,5-trimethoxy-benzyl)-amine | CHEMBL86960
Type:
Small organic molecule
Emp. Form.:
C17H21NO4
Mol. Mass.:
303.3529
SMILES:
COc1ccc(NCc2cc(OC)c(OC)c(OC)c2)cc1
: