Target
Similar to alpha-tubulin isoform 1
Ligand
BDBM50229500
Substrate
Meas. Tech.
ChEMBL_39798 (CHEMBL876771)
IC50
3100±n/a nM
Citation
 Cushman, MNagarathnam, DGopal, DChakraborti, AKLin, CMHamel, E Synthesis and evaluation of stilbene and dihydrostilbene derivatives as potential anticancer agents that inhibit tubulin polymerization. J Med Chem 34:2579-88 (1991)  
Target
Name:
Similar to alpha-tubulin isoform 1
Synonyms:
Similar to alpha-tubulin isoform 1
Type:
PROTEIN
Mol. Mass.:
10383.05
Organism:
Bos taurus
Description:
ChEMBL_104716
Residue:
99
  
Inhibitor
Name:
BDBM50229500
Synonyms:
CHEMBL86736
Type:
Small organic molecule
Emp. Form.:
C17H17BrO3
Mol. Mass.:
349.219
SMILES:
COc1cc(\C=C/c2ccc(Br)cc2)cc(OC)c1OC
: