Target
C5a anaphylatoxin chemotactic receptor 1
Ligand
BDBM50229894
Substrate
Meas. Tech.
ChEBML_41451
IC50
>141000±n/a nM
Citation
 Lanza, TJDurette, PLRollins, TSiciliano, SCianciarulo, DNKobayashi, SVCaldwell, CGSpringer, MSHagmann, WK Substituted 4,6-diaminoquinolines as inhibitors of C5a receptor binding. J Med Chem 35:252-8 (1992)  
Target
Name:
C5a anaphylatoxin chemotactic receptor 1
Synonyms:
C5AR C5AR1_HUMAN C5a anaphylatoxin chemotactic receptor C5a-R | CD_antigen=CD88
Type:
Enzyme
Mol. Mass.:
39347.68
Organism:
Homo sapiens (Human)
Description:
P21730
Residue:
350
  
Inhibitor
Name:
BDBM50229894
Synonyms:
CHEMBL86661
Type:
Small organic molecule
Emp. Form.:
C20H17ClN2O2
Mol. Mass.:
352.814
SMILES:
COc1cc(C)nc2ccc(NC(=O)\C=C\c3ccccc3Cl)cc12
: