Target
DNA topoisomerase 2-beta
Ligand
BDBM50229970
Substrate
Meas. Tech.
ChEBML_75879
IC50
796±n/a nM
Citation
 Taguchi, MKondo, HInoue, YKawahata, YJinbo, YSakamoto, FTsukamoto, G Synthesis and antibacterial activity of new tetracyclic quinolone antibacterials. J Med Chem 35:94-9 (1992)  
Target
Name:
DNA topoisomerase 2-beta
Synonyms:
DNA topoisomerase II TOP2B | TOP2B_HUMAN
Type:
PROTEIN
Mol. Mass.:
183284.13
Organism:
Homo sapiens (Human)
Description:
ChEMBL_51583
Residue:
1626
  
Inhibitor
Name:
BDBM50229970
Synonyms:
CHEMBL367876
Type:
Small organic molecule
Emp. Form.:
C18H16FN3O4S
Mol. Mass.:
389.401
SMILES:
CC1CN(CCN1)c1c(F)cc2c3c1OCc1csc(c(C(O)=O)c2=O)n31
: