Target
Similar to alpha-tubulin isoform 1
Ligand
BDBM50230623
Substrate
Meas. Tech.
ChEMBL_211321 (CHEMBL818980)
IC50
>40000±n/a nM
Citation
 Getahun, ZJurd, LChu, PSLin, CMHamel, E Synthesis of alkoxy-substituted diaryl compounds and correlation of ring separation with inhibition of tubulin polymerization: differential enhancement of inhibitory effects under suboptimal polymerization reaction conditions. J Med Chem 35:1058-67 (1992)  
Target
Name:
Similar to alpha-tubulin isoform 1
Synonyms:
Similar to alpha-tubulin isoform 1
Type:
PROTEIN
Mol. Mass.:
10383.05
Organism:
Bos taurus
Description:
ChEMBL_104716
Residue:
99
  
Inhibitor
Name:
BDBM50230623
Synonyms:
CHEMBL10255
Type:
Small organic molecule
Emp. Form.:
C16H18O5
Mol. Mass.:
290.3111
SMILES:
COc1ccc(cc1O)-c1cc(OC)c(OC)c(OC)c1
: