Target
Similar to alpha-tubulin isoform 1
Ligand
BDBM50230631
Substrate
Meas. Tech.
ChEMBL_211320 (CHEMBL818979)
IC50
2700±n/a nM
Citation
 Getahun, ZJurd, LChu, PSLin, CMHamel, E Synthesis of alkoxy-substituted diaryl compounds and correlation of ring separation with inhibition of tubulin polymerization: differential enhancement of inhibitory effects under suboptimal polymerization reaction conditions. J Med Chem 35:1058-67 (1992)  
Target
Name:
Similar to alpha-tubulin isoform 1
Synonyms:
Similar to alpha-tubulin isoform 1
Type:
PROTEIN
Mol. Mass.:
10383.05
Organism:
Bos taurus
Description:
ChEMBL_104716
Residue:
99
  
Inhibitor
Name:
BDBM50230631
Synonyms:
CHEMBL275976
Type:
Small organic molecule
Emp. Form.:
C19H22O4
Mol. Mass.:
314.3756
SMILES:
CCOc1cc2OCOc2cc1CCCc1ccc(OC)cc1
: