Target
Alpha-1A/Alpha-1B/Alpha-1D adrenergic receptor
Ligand
BDBM50230851
Substrate
Meas. Tech.
ChEMBL_34425 (CHEMBL649429)
Ki
0.680000±n/a nM
Citation
 Chern, JWTao, PLYen, MHLu, GYShiau, CYLai, YJChien, SLChan, CH Studies on quinazolines. 5. 2,3-dihydroimidazo[1,2-c]quinazoline derivatives: a novel class of potent and selective alpha 1-adrenoceptor antagonists and antihypertensive agents. J Med Chem 36:2196-207 (1993)  
Target
Name:
Alpha-1A/Alpha-1B/Alpha-1D adrenergic receptor
Synonyms:
Adrenergic receptor alpha-1 alpha-1 Adrenergic Receptor
Type:
Mol. Mass.:
Description:
ASSAY_ID of EBI is 303470
Components:
This complex has 3 components.
Component 1
Name:
Alpha-1B adrenergic receptor
Synonyms:
ADA1B_RAT Alpha 1B-adrenoceptor Alpha adrenergic receptor 1A and 1B Alpha-1Adrenoceptor Alpha-1B adrenoreceptor | adrenergic Alpha1B
Type:
G Protein-Coupled Receptor (GPCR)
Mol. Mass.:
56606.71
Organism:
Rattus norvegicus (rat)
Description:
Receptor binding assays were performed using rat cortical membranes.
Residue:
515
  
Component 2
Name:
Alpha-1A adrenergic receptor
Synonyms:
ADA1A_RAT Adra1c Alpha-1A adrenoceptor Alpha-1C adrenergic receptor | adrenergic Alpha1A
Type:
Protein
Mol. Mass.:
51620.15
Organism:
Rattus norvegicus (Rat)
Description:
P43140
Residue:
466
  
Component 3
Name:
Alpha-1D adrenergic receptor
Synonyms:
ADA1D_RAT Adra1d Alpha-1D adrenergic receptor | Serotonin 1a (5-HT1a) receptor/Adrenergic receptor alpha-1
Type:
Protein
Mol. Mass.:
59375.97
Organism:
Rattus norvegicus (Rat)
Description:
P23944
Residue:
561
  
Inhibitor
Name:
BDBM50230851
Synonyms:
CHEMBL70347
Type:
Small organic molecule
Emp. Form.:
C22H24ClN5O
Mol. Mass.:
409.912
SMILES:
CN1C(=O)N2CC(CN3CCN(CC3)c3ccccc3Cl)N=C2c2ccccc12
: