Target
Receptor-interacting serine/threonine-protein kinase 1
Ligand
BDBM50229508
Substrate
Meas. Tech.
ChEBML_1644186
EC50
8237±n/a nM
Citation
 Ren, YSu, YSun, LHe, SMeng, LLiao, DLiu, XMa, YLiu, CLi, SRuan, HLei, XWang, XZhang, Z Discovery of a Highly Potent, Selective, and Metabolically Stable Inhibitor of Receptor-Interacting Protein 1 (RIP1) for the Treatment of Systemic Inflammatory Response Syndrome. J Med Chem 60:972-986 (2017)  
Target
Name:
Receptor-interacting serine/threonine-protein kinase 1
Synonyms:
Cell death protein RIP RIP-1 RIPK1 Receptor-interacting protein 1
Type:
Enzyme Catalytic Domain
Mol. Mass.:
75926.99
Organism:
Homo sapiens (Human)
Description:
Q13546
Residue:
671
  
Inhibitor
Name:
BDBM50229508
Synonyms:
CHEMBL4064968
Type:
Small organic molecule
Emp. Form.:
C13H14F3NO
Mol. Mass.:
257.2516
SMILES:
CN(Cc1cc(F)cc(F)c1F)C(=O)C1CCC1
: