Target
Coagulation factor XII
Ligand
BDBM50230016
Substrate
Meas. Tech.
ChEMBL_1644378 (CHEMBL3993307)
Ki
>3000±n/a nM
Citation
 Middendorp, SJWilbs, JQuarroz, CCalzavarini, SAngelillo-Scherrer, AHeinis, C Peptide Macrocycle Inhibitor of Coagulation Factor XII with Subnanomolar Affinity and High Target Selectivity. J Med Chem 60:1151-1158 (2017)  
Target
Name:
Coagulation factor XII
Synonyms:
Beta-factor XIIa part 1 Carboxylesterase 2 (intestine, liver) Coagulation factor XII (FXII) Coagulation factor XIIa light chain FA12_HUMAN Factor XIIa (fXIIa) Hageman factor
Type:
Enzyme
Mol. Mass.:
67810.07
Organism:
Homo sapiens (Human)
Description:
P00748
Residue:
615
  
Inhibitor
Name:
BDBM50230016
Synonyms:
CHEMBL4060168
Type:
Small organic molecule
Emp. Form.:
C92H146N34O19S4
Mol. Mass.:
2160.62
SMILES:
CSCC[C@@H]1NC(=O)[C@H](CCCNC(N)=N)NC(=O)[C@H](Cc2ccccc2)NC(=O)[C@H](CSCCC(=O)N2CN3CN(C2)C(=O)CCSC[C@H](NC(=O)[C@@H]2CCCN2C1=O)C(=O)N[C@@H](CCCNC(N)=N)C(=O)N[C@@H](CCC(N)=O)C(=O)N[C@@H](CC(C)C)C(=O)N[C@@H](CCCNC(N)=N)C(=O)N[C@@H](CSCCC3=O)C(=O)N[C@@H](CCCNC(N)=N)C(=O)N[C@@H](Cc1c[nH]c2ccccc12)C(O)=O)NC(=O)[C@@H](N)CCCNC(N)=N
: