Target
Protein mono-ADP-ribosyltransferase PARP12
Ligand
BDBM50316226
Substrate
Meas. Tech.
ChEBML_1646313
IC50
79.0±n/a nM
Citation
 Thorsell, AGEkblad, TKarlberg, TLöw, MPinto, AFTrésaugues, LMoche, MCohen, MSSchüler, H Structural Basis for Potency and Promiscuity in Poly(ADP-ribose) Polymerase (PARP) and Tankyrase Inhibitors. J Med Chem 60:1262-1271 (2017)  
Target
Name:
Protein mono-ADP-ribosyltransferase PARP12
Synonyms:
ADP-ribosyltransferase diphtheria toxin-like 12 PAR12_HUMAN PARP12 ZC3HDC1 | Zinc finger CCCH domain-containing protein 1
Type:
PROTEIN
Mol. Mass.:
79092.00
Organism:
Homo sapiens (Human)
Description:
ChEMBL_107665
Residue:
701
  
Inhibitor
Name:
BDBM50316226
Synonyms:
(S)-2-(4-(piperidin-3-yl)phenyl)-2H-indazole-7-carboxamide MK-4827 | Niraparib
Type:
Small organic molecule
Emp. Form.:
C19H20N4O
Mol. Mass.:
320.3883
SMILES:
NC(=O)c1cccc2cn(nc12)-c1ccc(cc1)[C@@H]1CCCNC1
: