Target
Protein mono-ADP-ribosyltransferase PARP15
Ligand
BDBM50316226
Substrate
Meas. Tech.
ChEMBL_1646315 (CHEMBL3995371)
IC50
29200±n/a nM
Citation
 Thorsell, AGEkblad, TKarlberg, TLöw, MPinto, AFTrésaugues, LMoche, MCohen, MSSchüler, H Structural Basis for Potency and Promiscuity in Poly(ADP-ribose) Polymerase (PARP) and Tankyrase Inhibitors. J Med Chem 60:1262-1271 (2017)  
Target
Name:
Protein mono-ADP-ribosyltransferase PARP15
Synonyms:
(ARTD7 or PARP15) 2.4.2.- ADP-ribosyltransferase diphtheria toxin-like 7 B-aggressive lymphoma protein 3 Human diphtheria toxin-like ADP-ribosyltransferase (ARTD7 or PARP15, Y598L) PARP-15 Poly [ADP-ribose] polymerase 15 | Synonyms=BAL3
Type:
Mol. Mass.:
74595.89
Organism:
Homo sapiens (Human)
Description:
Q460N3
Residue:
678
  
Inhibitor
Name:
BDBM50316226
Synonyms:
(S)-2-(4-(piperidin-3-yl)phenyl)-2H-indazole-7-carboxamide MK-4827 | Niraparib
Type:
Small organic molecule
Emp. Form.:
C19H20N4O
Mol. Mass.:
320.3883
SMILES:
NC(=O)c1cccc2cn(nc12)-c1ccc(cc1)[C@@H]1CCCNC1
: