Target
Dual specificity tyrosine-phosphorylation-regulated kinase 1A
Ligand
BDBM50236543
Substrate
Meas. Tech.
ChEMBL_1659283 (CHEMBL4008895)
IC50
6.6±n/a nM
Citation
 Zhou, QPhoa, AFAbbassi, RHHoque, MReekie, TAFont, JSRyan, RMStringer, BWDay, BWJohns, TGMunoz, LKassiou, M Structural Optimization and Pharmacological Evaluation of Inhibitors Targeting Dual-Specificity Tyrosine Phosphorylation-Regulated Kinases (DYRK) and CDC-like kinases (CLK) in Glioblastoma. J Med Chem 60:2052-2070 (2017)  
Target
Name:
Dual specificity tyrosine-phosphorylation-regulated kinase 1A
Synonyms:
DYR1A_HUMAN DYRK1A Dual specificity YAK1-related kinase 1A (Dyrk1A) Dual-specificity tyrosine-phosphorylation regulated kinase 1A HP86 MNBH
Type:
Enzyme
Mol. Mass.:
85616.61
Organism:
Homo sapiens (Human)
Description:
Q13627
Residue:
763
  
Inhibitor
Name:
BDBM50236543
Synonyms:
CHEMBL4078550
Type:
Small organic molecule
Emp. Form.:
C21H17N3O2
Mol. Mass.:
343.3786
SMILES:
CC(=O)Nc1ccc(cc1)-c1cnc2[nH]cc(-c3ccc(O)cc3)c2c1
: