Target
5-hydroxytryptamine receptor 6
Ligand
BDBM50236768
Substrate
Meas. Tech.
ChEMBL_1659425 (CHEMBL4009037)
Ki
20±n/a nM
Citation
 Nirogi, RShinde, AKambhampati, RSMohammed, ARSaraf, SKBadange, RKBandyala, TRBhatta, VBojja, KReballi, VSubramanian, RBenade, VPalacharla, RCBhyrapuneni, GJayarajan, PGoyal, VJasti, V Discovery and Development of 1-[(2-Bromophenyl)sulfonyl]-5-methoxy-3-[(4-methyl-1-piperazinyl)methyl]-1H-indole Dimesylate Monohydrate (SUVN-502): A Novel, Potent, Selective and Orally Active Serotonin 6 (5-HT J Med Chem 60:1843-1859 (2017)  
Target
Name:
5-hydroxytryptamine receptor 6
Synonyms:
5-HT-6 5-hydroxytryptamine receptor 6 (5-HT-6) 5-hydroxytryptamine receptor 6 (5HT6) HTR6 Serotonin 6 (5-HT6) receptor | Serotonin Receptor 6
Type:
G Protein-Coupled Receptor (GPCR)
Mol. Mass.:
46968.43
Organism:
Homo sapiens (Human)
Description:
P50406
Residue:
440
  
Inhibitor
Name:
BDBM50236768
Synonyms:
CHEMBL4070785
Type:
Small organic molecule
Emp. Form.:
C22H26FN3O3S
Mol. Mass.:
431.524
SMILES:
CCN1CCN(Cc2cn(c3ccc(OC)cc23)S(=O)(=O)c2ccc(F)cc2)CC1
: