Target
Polyunsaturated fatty acid lipoxygenase ALOX15
Ligand
BDBM50237598
Substrate
Meas. Tech.
ChEMBL_1661711 (CHEMBL4011323)
IC50
1000±n/a nM
Citation
 Tirapegui, CAcevedo-Fuentes, WDahech, PTorrent, CBarrias, PRojas-Poblete, MMascayano, C Easy and rapid preparation of benzoylhydrazides and their diazene derivatives as inhibitors of 15-lipoxygenase. Bioorg Med Chem Lett 27:1649-1653 (2017)  
Target
Name:
Polyunsaturated fatty acid lipoxygenase ALOX15
Synonyms:
15-Lipoxygenase-1 (15-LOX-1) Arachidonate 15-lipoxygenase LOG15 Reticulocyte 15-lipoxygenase-1 | Sphingosine 1-phosphate receptor 1 (S1P1)
Type:
Protein
Mol. Mass.:
74804.05
Organism:
Homo sapiens (Human)
Description:
Residue:
662
  
Inhibitor
Name:
BDBM50237598
Synonyms:
CHEMBL395428 | US11660306, Example Boswellic acid
Type:
Small organic molecule
Emp. Form.:
C30H48O3
Mol. Mass.:
456.7003
SMILES:
[H][C@@]12CC(C)(C)CC[C@]1(C)CC[C@]1(C)C2=CC[C@]2([H])[C@@]3(C)CC[C@@H](O)[C@](C)(C(O)=O)[C@]3([H])CC[C@@]12C
: