Target
Sodium-dependent dopamine transporter
Ligand
BDBM50236726
Substrate
Meas. Tech.
ChEMBL_1661729 (CHEMBL4011341)
EC50
860±n/a nM
Citation
 Tosh, DKJanowsky, AEshleman, AJWarnick, EGao, ZGChen, ZGizewski, EAuchampach, JASalvemini, DJacobson, KA Scaffold Repurposing of Nucleosides (Adenosine Receptor Agonists): Enhanced Activity at the Human Dopamine and Norepinephrine Sodium Symporters. J Med Chem 60:3109-3123 (2017)  
Target
Name:
Sodium-dependent dopamine transporter
Synonyms:
DA transporter DAT1 Dopamine transporter protein (DAT) SC6A3_HUMAN Sodium-dependent dopamine transporter Solute carrier family 6 member 3
Type:
Multi-pass membrane protein
Mol. Mass.:
68497.11
Organism:
Homo sapiens (Human)
Description:
Q01959
Residue:
620
  
Inhibitor
Name:
BDBM50236726
Synonyms:
CHEMBL4092411
Type:
Small organic molecule
Emp. Form.:
C18H16ClN5O5S
Mol. Mass.:
449.868
SMILES:
CNc1nc(nc2n(cnc12)[C@@H]1O[C@@H]([C@@H](O)[C@H]1O)C(=O)OC)C#Cc1ccc(Cl)s1
: