Target
Transmembrane domain-containing protein TMIGD3
Ligand
BDBM50116878
Substrate
Meas. Tech.
ChEMBL_1661726 (CHEMBL4011338)
Ki
1.7±n/a nM
Citation
 Tosh, DKJanowsky, AEshleman, AJWarnick, EGao, ZGChen, ZGizewski, EAuchampach, JASalvemini, DJacobson, KA Scaffold Repurposing of Nucleosides (Adenosine Receptor Agonists): Enhanced Activity at the Human Dopamine and Norepinephrine Sodium Symporters. J Med Chem 60:3109-3123 (2017)  
Target
Name:
Transmembrane domain-containing protein TMIGD3
Synonyms:
TMIG3_HUMAN Transmembrane domain-containing protein TMIGD3
Type:
PROTEIN
Mol. Mass.:
30335.79
Organism:
Homo sapiens (Human)
Description:
ChEMBL_114868
Residue:
266
  
Inhibitor
Name:
BDBM50116878
Synonyms:
CHEMBL3612940
Type:
Small organic molecule
Emp. Form.:
C22H22ClN5O3S
Mol. Mass.:
471.96
SMILES:
[H][C@]12C[C@]1([C@@H](O)[C@@H](O)[C@@H]2n1cnc2c(NCC)cc(nc12)C#Cc1ccc(Cl)s1)C(=O)NC
: