Target
Adenosine receptor A3
Ligand
BDBM50237770
Substrate
Meas. Tech.
ChEMBL_1661884 (CHEMBL4011496)
Ki
1.4±n/a nM
Citation
 Yu, JZhao, LXPark, JLee, HWSahu, PKCui, MMoss, SMHammes, EWarnick, EGao, ZGNoh, MChoi, SAhn, HCChoi, JJacobson, KAJeong, LS N J Med Chem 60:3422-3437 (2017)  
Target
Name:
Adenosine receptor A3
Synonyms:
A3 adenosine receptor (hA3) ADORA3 | Adenosine A3 receptor (A3AR)
Type:
G Protein-Coupled Receptor (GPCR)
Mol. Mass.:
36197.32
Organism:
Homo sapiens (Human)
Description:
P0DMS8
Residue:
318
  
Inhibitor
Name:
BDBM50237770
Synonyms:
CHEMBL4067750
Type:
Small organic molecule
Emp. Form.:
C15H20N6O3Se
Mol. Mass.:
411.32
SMILES:
CNC(=O)[C@H]1[Se][C@H]([C@H](O)[C@@H]1O)n1cnc2c(NC3CCC3)ncnc12
: