Target
TGF-beta receptor type-1
Ligand
BDBM50238070
Substrate
Meas. Tech.
ChEMBL_1662764 (CHEMBL4012445)
EC50
13±n/a nM
Citation
 Sabat, MWang, HScorah, NLawson, JDAtienza, JKamran, RHixon, MSDougan, DR Design, synthesis and optimization of 7-substituted-pyrazolo[4,3-b]pyridine ALK5 (activin receptor-like kinase 5) inhibitors. Bioorg Med Chem Lett 27:1955-1961 (2017)  
Target
Name:
TGF-beta receptor type-1
Synonyms:
ALK-5 Activin A receptor type II-like protein kinase of 53kD SKR4 TGF-beta receptor type I TGFBR1 TGFR1_HUMAN Transforming growth factor-beta receptor type I
Type:
enzyme
Mol. Mass.:
55968.24
Organism:
Homo sapiens (Human)
Description:
P36897
Residue:
503
  
Inhibitor
Name:
BDBM50238070
Synonyms:
CHEMBL4069101
Type:
Small organic molecule
Emp. Form.:
C20H16ClFN6O
Mol. Mass.:
410.832
SMILES:
Cc1cnc(cc1Nc1ccnc2cn(CC(N)=O)nc12)-c1cc(Cl)ccc1F
: