Target
Adenosine receptor A1
Ligand
BDBM50413803
Substrate
Meas. Tech.
ChEBML_1663190
Ki
1.2±n/a nM
Citation
 Falsini, MSquarcialupi, LCatarzi, DVarano, FBetti, MDal Ben, DMarucci, GBuccioni, MVolpini, RDe Vita, TCavalli, AColotta, V The 1,2,4-Triazolo[4,3-a]pyrazin-3-one as a Versatile Scaffold for the Design of Potent Adenosine Human Receptor Antagonists. Structural Investigations to Target the A J Med Chem 60:5772-5790 (2017)  
Target
Name:
Adenosine receptor A1
Synonyms:
A1 adenosine receptor (hA1) AA1R_HUMAN ADORA1 Adenosine A1-receptor Adenosine receptor A1 (hA1) | Adenosine transporter (AdT)
Type:
G Protein-Coupled Receptor (GPCR)
Mol. Mass.:
36520.92
Organism:
Homo sapiens (Human)
Description:
P30542
Residue:
326
  
Inhibitor
Name:
BDBM50413803
Synonyms:
CHEMBL487754
Type:
Small organic molecule
Emp. Form.:
C17H23ClN6O4
Mol. Mass.:
410.855
SMILES:
CCNC(=O)C1OC(C(O)C1O)n1cnc2c(NC3CCCC3)nc(Cl)nc12
: