Target
Carbonic anhydrase 9
Ligand
BDBM50238777
Substrate
Meas. Tech.
ChEMBL_1664111 (CHEMBL4013792)
Ki
4.6±n/a nM
Citation
 Falsini, MSquarcialupi, LCatarzi, DVarano, FBetti, MDi Cesare Mannelli, LTenci, BGhelardini, CTanc, MAngeli, ASupuran, CTColotta, V 3-Hydroxy-1H-quinazoline-2,4-dione as a New Scaffold To Develop Potent and Selective Inhibitors of the Tumor-Associated Carbonic Anhydrases IX and XII. J Med Chem 60:6428-6439 (2017)  
Target
Name:
Carbonic anhydrase 9
Synonyms:
CA-IX CAH9_HUMAN Carbonic anhydrase 9 (CA IX) Carbonic anhydrase 9 precursor Carbonic anhydrase IX (CAIX) Carbonic anhydrases; II & IX MN RCC-associated antigen G250
Type:
Enzyme
Mol. Mass.:
49669.03
Organism:
Homo sapiens (Human)
Description:
Catalytic domain of human cloned isozyme was used in the assay
Residue:
459
  
Inhibitor
Name:
BDBM50238777
Synonyms:
CHEMBL4096515
Type:
Small organic molecule
Emp. Form.:
C8H5N3O5
Mol. Mass.:
223.1424
SMILES:
On1c(=O)[nH]c2ccc(cc2c1=O)[N+]([O-])=O
: